{"text_format":"1","workbook":"xlsx","n_sheets":3,"sheets":["Oferta","Rabaty","Cennik"],"not_rendered":{"charts":0,"images":2,"macros":1,"external_links":0,"defined_names":1,"comments":0,"pivot_tables":0},"unopened":[],"bounds":{"document_bytes":16777216,"sheet_cells":100000,"rows_first":2000,"rows_last":500,"rows_between":2000,"halvings":0,"cell_chars":16384,"cell_head_chars":4096},"cells_cut":0,"cells_raw":0,"read":"whole","date_system":"1900"}

{"sheet":"Oferta","index":0,"n_rows":305,"n_cols":47,"rows_kept":305,"cut":false,"hidden":false,"merged":[[1,3,1,6],[9,1,10,1],[9,2,10,2],[8,7,8,8],[8,5,8,6],[10,46,10,49],[9,4,10,4],[9,5,10,5],[9,6,10,6],[9,7,10,7],[9,8,10,8]]}
[null,null,null,null,null,null,null,"Data:",{"$f":"TODAY()","v":"2018-10-09"}]
[null,null,null,null,null,null,null,"Dla:","ZZ02",null,null,null,null,null,null,null,null,null,null,null,null,null,null,null,null,null,null,null,null,null,null,null,null,null,null,null,null,null,1,null,null,{"$f":"CONCATENATE(AN16,AM14,AO16,AM14,AU11)","v":"__Wpisz nazwę zestawienia"}]
[null,null,null,null,null,null,null,null,null,null,null,null,null,null,null,null,null,null,null,null,null,null,null,null,null,null,null,null,null,null,null,null,null,null,null,null,null,null,null,null,null,{"$f":"IF($R$2=1,\"1\",\"\")","v":""}]
[null,null,null,null,null,null,null,null,null,null,null,null,null,null,null,null,null,null,null,null,null,null,null,null,null,null,null,null,null,null,null,null,null,null,null,null,null,null,null,null,null,{"$f":"IF($R$2=2,\"2\",\"\")","v":""}]
[null,null,null,null,null,null,null,null,null,null,null,null,null,null,null,null,null,null,null,null,null,null,null,null,null,null,null,null,null,null,null,null,null,null,null,null,null,null,null,null,null,{"$f":"IF($R$2=3,\"3\",\"\")","v":""}]
[null,null,null,null,null,null,null,null,null,null,null,null,null,null,null,null,null,null,null,null,null,null,null,null,null,null,null,null,null,null,null,null,null,null,null,null,null,null,null,null,null,{"$f":"IF($R$2=4,\"4\",\"\")","v":""}]
[null,null,null,null,null,null,null,null,null,null,null,null,null,null,null,null,null,null,null,null,null,null,null,null,null,null,null,null,null,null,null,null,null,null,null,null,null,null,null,null,null,{"$f":"IF($R$2=5,\"5\",\"\")","v":""}]
[null,null,null,null,null,null,null,null,null,null,null,null,null,null,null,null,null,null,null,null,null,null,null,null,null,null,null,null,null,null,null,null,null,null,null,null,null,null,null,null,null,{"$f":"IF($R$2=6,\"6\",\"\")","v":""}]
[null,"                          Cennik   obowiązuje od ",null,null,null,"Wartość netto:",null,{"$f":"SUM(I12:I92)","v":0},null,null,null,null,null,null,null,null,null,null,null,null,null,null,null,null,null,null,null,null,null,null,null,null,null,null,null,null,null,null,null,null,null,{"$f":"IF($R$2=7,\"7\",\"\")","v":""}]
["L.p.","Numer    katalogowy","Ilość","Wpisz nazwę zestawienia","Cennik netto PLN","Rabat %","Grupa rabatowa","Cena  netto","Wartość netto",null,null,null,null,null,null,null,null,null,null,null,null,null,null,null,null,null,null,null,null,null,null,null,null,null,null,null,null,null,null,null,null,{"$f":"IF($R$2=8,\"8\",\"\")","v":""}]
[null,null,null,"Nazwa produktu",null,null,null,null,null,null,null,null,null,null,null,null,null,null,null,null,null,null,null,null,null,null,null,null,null,null,null,null,null,null,null,null,null,null,null,null,null,{"$f":"IF($R$2=9,\"9\",\"\")","v":""},null,null,null,null,{"$f":"IF(D10=\"\",\"\",D10)","v":"Wpisz nazwę zestawienia"}]
[{"$f":"IF(B12<>\"\",A11+1,\"\")","v":""},null,{"$f":"IF(A12<>\"\",1,\"\")","v":""},{"$f":"IF($B12<>\"\",VLOOKUP(IF(ISNUMBER($B12),TEXT($B12,\"0\"),$B12),Cennik!$A$1:$E$2128,2,FALSE),\"\")","v":""},{"$f":"IF($B12<>\"\",VLOOKUP(IF(ISNUMBER($B12),TEXT($B12,\"0\"),$B12),Cennik!$A$1:$E$2128,3,FALSE),\"\")","v":""},{"$f":"IF($G12<>\"\",VLOOKUP(IF(ISNUMBER($G12),TEXT($G12,\"0\"),$G12),Rabaty!$B$2:$C$26,2,FALSE),\"\")","v":""},{"$f":"IF($B12<>\"\",VLOOKUP(IF(ISNUMBER($B12),TEXT($B12,\"0\"),$B12),Cennik!$A$1:$E$2128,4,FALSE),\"\")","v":""},{"$f":"IF(B12<>\"\",E12*(1-F12),\"\")","v":""},{"$f":"IF(C12<>\"\",H12*C12,\"\")","v":""},null,null,null,null,null,null,{"$f":"IF(B12<>\"\",$I$2,\"\")","v":""},null,null,null,null,null,null,null,null,null,null,null,null,null,null,null,null,null,null,null,null,null,null,null,null,null,{"$f":"IF($R$2=10,\"10\",\"\")","v":""}]
["",null,"",{"$f":"IF($B13<>\"\",VLOOKUP(IF(ISNUMBER($B13),TEXT($B13,\"0\"),$B13),Cennik!$A$1:$E$2128,2,FALSE),\"\")","v":""},{"$f":"IF($B13<>\"\",VLOOKUP(IF(ISNUMBER($B13),TEXT($B13,\"0\"),$B13),Cennik!$A$1:$E$2128,3,FALSE),\"\")","v":""},{"$f":"IF($G13<>\"\",VLOOKUP(IF(ISNUMBER($G13),TEXT($G13,\"0\"),$G13),Rabaty!$B$2:$C$26,2,FALSE),\"\")","v":""},{"$f":"IF($B13<>\"\",VLOOKUP(IF(ISNUMBER($B13),TEXT($B13,\"0\"),$B13),Cennik!$A$1:$E$2128,4,FALSE),\"\")","v":""},"","",null,null,null,null,null,null,{"$f":"IF(B13<>\"\",$I$2,\"\")","v":""},null,null,null,null,null,null,null,null,null,null,null,null,null,null,null,null,null,null,null,null,null,null,null,{"$f":"TODAY()","v":"2018-10-09"}]
["",null,"",{"$f":"IF($B14<>\"\",VLOOKUP(IF(ISNUMBER($B14),TEXT($B14,\"0\"),$B14),Cennik!$A$1:$E$2128,2,FALSE),\"\")","v":""},{"$f":"IF($B14<>\"\",VLOOKUP(IF(ISNUMBER($B14),TEXT($B14,\"0\"),$B14),Cennik!$A$1:$E$2128,3,FALSE),\"\")","v":""},{"$f":"IF($G14<>\"\",VLOOKUP(IF(ISNUMBER($G14),TEXT($G14,\"0\"),$G14),Rabaty!$B$2:$C$26,2,FALSE),\"\")","v":""},{"$f":"IF($B14<>\"\",VLOOKUP(IF(ISNUMBER($B14),TEXT($B14,\"0\"),$B14),Cennik!$A$1:$E$2128,4,FALSE),\"\")","v":""},"","",null,null,null,null,null,null,"",null,null,null,null,null,null,null,null,null,null,null,null,null,null,null,null,null,null,null,null,null,null,"_","2014-03-23"]
["",null,"",{"$f":"IF($B15<>\"\",VLOOKUP(IF(ISNUMBER($B15),TEXT($B15,\"0\"),$B15),Cennik!$A$1:$E$2128,2,FALSE),\"\")","v":""},{"$f":"IF($B15<>\"\",VLOOKUP(IF(ISNUMBER($B15),TEXT($B15,\"0\"),$B15),Cennik!$A$1:$E$2128,3,FALSE),\"\")","v":""},{"$f":"IF($G15<>\"\",VLOOKUP(IF(ISNUMBER($G15),TEXT($G15,\"0\"),$G15),Rabaty!$B$2:$C$26,2,FALSE),\"\")","v":""},{"$f":"IF($B15<>\"\",VLOOKUP(IF(ISNUMBER($B15),TEXT($B15,\"0\"),$B15),Cennik!$A$1:$E$2128,4,FALSE),\"\")","v":""},"","",null,null,null,null,null,null,"",null,null,null,null,null,null,null,null,null,null,null,null,null,null,null,null,null,null,null,null,null,3,"/",2,3,"/201",4]
["",null,"",{"$f":"IF($B16<>\"\",VLOOKUP(IF(ISNUMBER($B16),TEXT($B16,\"0\"),$B16),Cennik!$A$1:$E$2128,2,FALSE),\"\")","v":""},{"$f":"IF($B16<>\"\",VLOOKUP(IF(ISNUMBER($B16),TEXT($B16,\"0\"),$B16),Cennik!$A$1:$E$2128,3,FALSE),\"\")","v":""},{"$f":"IF($G16<>\"\",VLOOKUP(IF(ISNUMBER($G16),TEXT($G16,\"0\"),$G16),Rabaty!$B$2:$C$26,2,FALSE),\"\")","v":""},{"$f":"IF($B16<>\"\",VLOOKUP(IF(ISNUMBER($B16),TEXT($B16,\"0\"),$B16),Cennik!$A$1:$E$2128,4,FALSE),\"\")","v":""},"","",null,null,null,null,null,null,"",null,null,null,null,null,null,null,null,null,null,null,null,null,null,null,null,null,null,null,null,null,{"$f":"CONCATENATE(AL15,AM15,AN15,AO15,AP15,AQ15,AR15)","v":"3/23/2014"}]
["",null,"",{"$f":"IF($B17<>\"\",VLOOKUP(IF(ISNUMBER($B17),TEXT($B17,\"0\"),$B17),Cennik!$A$1:$E$2128,2,FALSE),\"\")","v":""},{"$f":"IF($B17<>\"\",VLOOKUP(IF(ISNUMBER($B17),TEXT($B17,\"0\"),$B17),Cennik!$A$1:$E$2128,3,FALSE),\"\")","v":""},{"$f":"IF($G17<>\"\",VLOOKUP(IF(ISNUMBER($G17),TEXT($G17,\"0\"),$G17),Rabaty!$B$2:$C$26,2,FALSE),\"\")","v":""},{"$f":"IF($B17<>\"\",VLOOKUP(IF(ISNUMBER($B17),TEXT($B17,\"0\"),$B17),Cennik!$A$1:$E$2128,4,FALSE),\"\")","v":""},"","",null,null,null,null,null,null,""]
["",null,"",{"$f":"IF($B18<>\"\",VLOOKUP(IF(ISNUMBER($B18),TEXT($B18,\"0\"),$B18),Cennik!$A$1:$E$2128,2,FALSE),\"\")","v":""},{"$f":"IF($B18<>\"\",VLOOKUP(IF(ISNUMBER($B18),TEXT($B18,\"0\"),$B18),Cennik!$A$1:$E$2128,3,FALSE),\"\")","v":""},{"$f":"IF($G18<>\"\",VLOOKUP(IF(ISNUMBER($G18),TEXT($G18,\"0\"),$G18),Rabaty!$B$2:$C$26,2,FALSE),\"\")","v":""},{"$f":"IF($B18<>\"\",VLOOKUP(IF(ISNUMBER($B18),TEXT($B18,\"0\"),$B18),Cennik!$A$1:$E$2128,4,FALSE),\"\")","v":""},"","",null,null,null,null,null,null,""]
["",null,"",{"$f":"IF($B19<>\"\",VLOOKUP(IF(ISNUMBER($B19),TEXT($B19,\"0\"),$B19),Cennik!$A$1:$E$2128,2,FALSE),\"\")","v":""},{"$f":"IF($B19<>\"\",VLOOKUP(IF(ISNUMBER($B19),TEXT($B19,\"0\"),$B19),Cennik!$A$1:$E$2128,3,FALSE),\"\")","v":""},{"$f":"IF($G19<>\"\",VLOOKUP(IF(ISNUMBER($G19),TEXT($G19,\"0\"),$G19),Rabaty!$B$2:$C$26,2,FALSE),\"\")","v":""},{"$f":"IF($B19<>\"\",VLOOKUP(IF(ISNUMBER($B19),TEXT($B19,\"0\"),$B19),Cennik!$A$1:$E$2128,4,FALSE),\"\")","v":""},"","",null,null,null,null,null,null,""]
["",null,"",{"$f":"IF($B20<>\"\",VLOOKUP(IF(ISNUMBER($B20),TEXT($B20,\"0\"),$B20),Cennik!$A$1:$E$2128,2,FALSE),\"\")","v":""},{"$f":"IF($B20<>\"\",VLOOKUP(IF(ISNUMBER($B20),TEXT($B20,\"0\"),$B20),Cennik!$A$1:$E$2128,3,FALSE),\"\")","v":""},{"$f":"IF($G20<>\"\",VLOOKUP(IF(ISNUMBER($G20),TEXT($G20,\"0\"),$G20),Rabaty!$B$2:$C$26,2,FALSE),\"\")","v":""},{"$f":"IF($B20<>\"\",VLOOKUP(IF(ISNUMBER($B20),TEXT($B20,\"0\"),$B20),Cennik!$A$1:$E$2128,4,FALSE),\"\")","v":""},"","",null,null,null,null,null,null,""]
["",null,"",{"$f":"IF($B21<>\"\",VLOOKUP(IF(ISNUMBER($B21),TEXT($B21,\"0\"),$B21),Cennik!$A$1:$E$2128,2,FALSE),\"\")","v":""},{"$f":"IF($B21<>\"\",VLOOKUP(IF(ISNUMBER($B21),TEXT($B21,\"0\"),$B21),Cennik!$A$1:$E$2128,3,FALSE),\"\")","v":""},{"$f":"IF($G21<>\"\",VLOOKUP(IF(ISNUMBER($G21),TEXT($G21,\"0\"),$G21),Rabaty!$B$2:$C$26,2,FALSE),\"\")","v":""},{"$f":"IF($B21<>\"\",VLOOKUP(IF(ISNUMBER($B21),TEXT($B21,\"0\"),$B21),Cennik!$A$1:$E$2128,4,FALSE),\"\")","v":""},"","",null,null,null,null,null,null,""]
["",null,"",{"$f":"IF($B22<>\"\",VLOOKUP(IF(ISNUMBER($B22),TEXT($B22,\"0\"),$B22),Cennik!$A$1:$E$2128,2,FALSE),\"\")","v":""},{"$f":"IF($B22<>\"\",VLOOKUP(IF(ISNUMBER($B22),TEXT($B22,\"0\"),$B22),Cennik!$A$1:$E$2128,3,FALSE),\"\")","v":""},{"$f":"IF($G22<>\"\",VLOOKUP(IF(ISNUMBER($G22),TEXT($G22,\"0\"),$G22),Rabaty!$B$2:$C$26,2,FALSE),\"\")","v":""},{"$f":"IF($B22<>\"\",VLOOKUP(IF(ISNUMBER($B22),TEXT($B22,\"0\"),$B22),Cennik!$A$1:$E$2128,4,FALSE),\"\")","v":""},"","",null,null,null,null,null,null,""]
["",null,"",{"$f":"IF($B23<>\"\",VLOOKUP(IF(ISNUMBER($B23),TEXT($B23,\"0\"),$B23),Cennik!$A$1:$E$2128,2,FALSE),\"\")","v":""},{"$f":"IF($B23<>\"\",VLOOKUP(IF(ISNUMBER($B23),TEXT($B23,\"0\"),$B23),Cennik!$A$1:$E$2128,3,FALSE),\"\")","v":""},{"$f":"IF($G23<>\"\",VLOOKUP(IF(ISNUMBER($G23),TEXT($G23,\"0\"),$G23),Rabaty!$B$2:$C$26,2,FALSE),\"\")","v":""},{"$f":"IF($B23<>\"\",VLOOKUP(IF(ISNUMBER($B23),TEXT($B23,\"0\"),$B23),Cennik!$A$1:$E$2128,4,FALSE),\"\")","v":""},"","",null,null,null,null,null,null,""]
["",null,"",{"$f":"IF($B24<>\"\",VLOOKUP(IF(ISNUMBER($B24),TEXT($B24,\"0\"),$B24),Cennik!$A$1:$E$2128,2,FALSE),\"\")","v":""},{"$f":"IF($B24<>\"\",VLOOKUP(IF(ISNUMBER($B24),TEXT($B24,\"0\"),$B24),Cennik!$A$1:$E$2128,3,FALSE),\"\")","v":""},{"$f":"IF($G24<>\"\",VLOOKUP(IF(ISNUMBER($G24),TEXT($G24,\"0\"),$G24),Rabaty!$B$2:$C$26,2,FALSE),\"\")","v":""},{"$f":"IF($B24<>\"\",VLOOKUP(IF(ISNUMBER($B24),TEXT($B24,\"0\"),$B24),Cennik!$A$1:$E$2128,4,FALSE),\"\")","v":""},"","",null,null,null,null,null,null,""]
["",null,"",{"$f":"IF($B25<>\"\",VLOOKUP(IF(ISNUMBER($B25),TEXT($B25,\"0\"),$B25),Cennik!$A$1:$E$2128,2,FALSE),\"\")","v":""},{"$f":"IF($B25<>\"\",VLOOKUP(IF(ISNUMBER($B25),TEXT($B25,\"0\"),$B25),Cennik!$A$1:$E$2128,3,FALSE),\"\")","v":""},{"$f":"IF($G25<>\"\",VLOOKUP(IF(ISNUMBER($G25),TEXT($G25,\"0\"),$G25),Rabaty!$B$2:$C$26,2,FALSE),\"\")","v":""},{"$f":"IF($B25<>\"\",VLOOKUP(IF(ISNUMBER($B25),TEXT($B25,\"0\"),$B25),Cennik!$A$1:$E$2128,4,FALSE),\"\")","v":""},"","",null,null,null,null,null,null,""]
["",null,"",{"$f":"IF($B26<>\"\",VLOOKUP(IF(ISNUMBER($B26),TEXT($B26,\"0\"),$B26),Cennik!$A$1:$E$2128,2,FALSE),\"\")","v":""},{"$f":"IF($B26<>\"\",VLOOKUP(IF(ISNUMBER($B26),TEXT($B26,\"0\"),$B26),Cennik!$A$1:$E$2128,3,FALSE),\"\")","v":""},{"$f":"IF($G26<>\"\",VLOOKUP(IF(ISNUMBER($G26),TEXT($G26,\"0\"),$G26),Rabaty!$B$2:$C$26,2,FALSE),\"\")","v":""},{"$f":"IF($B26<>\"\",VLOOKUP(IF(ISNUMBER($B26),TEXT($B26,\"0\"),$B26),Cennik!$A$1:$E$2128,4,FALSE),\"\")","v":""},"","",null,null,null,null,null,null,""]
["",null,"",{"$f":"IF($B27<>\"\",VLOOKUP(IF(ISNUMBER($B27),TEXT($B27,\"0\"),$B27),Cennik!$A$1:$E$2128,2,FALSE),\"\")","v":""},{"$f":"IF($B27<>\"\",VLOOKUP(IF(ISNUMBER($B27),TEXT($B27,\"0\"),$B27),Cennik!$A$1:$E$2128,3,FALSE),\"\")","v":""},{"$f":"IF($G27<>\"\",VLOOKUP(IF(ISNUMBER($G27),TEXT($G27,\"0\"),$G27),Rabaty!$B$2:$C$26,2,FALSE),\"\")","v":""},{"$f":"IF($B27<>\"\",VLOOKUP(IF(ISNUMBER($B27),TEXT($B27,\"0\"),$B27),Cennik!$A$1:$E$2128,4,FALSE),\"\")","v":""},"","",null,null,null,null,null,null,""]
["",null,"",{"$f":"IF($B28<>\"\",VLOOKUP(IF(ISNUMBER($B28),TEXT($B28,\"0\"),$B28),Cennik!$A$1:$E$2128,2,FALSE),\"\")","v":""},{"$f":"IF($B28<>\"\",VLOOKUP(IF(ISNUMBER($B28),TEXT($B28,\"0\"),$B28),Cennik!$A$1:$E$2128,3,FALSE),\"\")","v":""},{"$f":"IF($G28<>\"\",VLOOKUP(IF(ISNUMBER($G28),TEXT($G28,\"0\"),$G28),Rabaty!$B$2:$C$26,2,FALSE),\"\")","v":""},{"$f":"IF($B28<>\"\",VLOOKUP(IF(ISNUMBER($B28),TEXT($B28,\"0\"),$B28),Cennik!$A$1:$E$2128,4,FALSE),\"\")","v":""},"","",null,null,null,null,null,null,""]
["",null,"",{"$f":"IF($B29<>\"\",VLOOKUP(IF(ISNUMBER($B29),TEXT($B29,\"0\"),$B29),Cennik!$A$1:$E$2128,2,FALSE),\"\")","v":""},{"$f":"IF($B29<>\"\",VLOOKUP(IF(ISNUMBER($B29),TEXT($B29,\"0\"),$B29),Cennik!$A$1:$E$2128,3,FALSE),\"\")","v":""},{"$f":"IF($G29<>\"\",VLOOKUP(IF(ISNUMBER($G29),TEXT($G29,\"0\"),$G29),Rabaty!$B$2:$C$26,2,FALSE),\"\")","v":""},{"$f":"IF($B29<>\"\",VLOOKUP(IF(ISNUMBER($B29),TEXT($B29,\"0\"),$B29),Cennik!$A$1:$E$2128,4,FALSE),\"\")","v":""},"","",null,null,null,null,null,null,""]
["",null,"",{"$f":"IF($B30<>\"\",VLOOKUP(IF(ISNUMBER($B30),TEXT($B30,\"0\"),$B30),Cennik!$A$1:$E$2128,2,FALSE),\"\")","v":""},{"$f":"IF($B30<>\"\",VLOOKUP(IF(ISNUMBER($B30),TEXT($B30,\"0\"),$B30),Cennik!$A$1:$E$2128,3,FALSE),\"\")","v":""},{"$f":"IF($G30<>\"\",VLOOKUP(IF(ISNUMBER($G30),TEXT($G30,\"0\"),$G30),Rabaty!$B$2:$C$26,2,FALSE),\"\")","v":""},{"$f":"IF($B30<>\"\",VLOOKUP(IF(ISNUMBER($B30),TEXT($B30,\"0\"),$B30),Cennik!$A$1:$E$2128,4,FALSE),\"\")","v":""},"","",null,null,null,null,null,null,""]
{"$rows_left_out":276}
{"sheet":"Rabaty","index":1,"n_rows":27,"n_cols":20,"rows_kept":27,"cut":false,"hidden":false,"merged":[]}
["Nazwa grupy","Grupa","Rabat"]
["Wyłączniki nadmiarowo-prądowe N","1  -HY -01",0.36]
["Wyłączniki nadmiarowo-prądowe H","1  -HY -02",0.31]
["Rozłączniki modułowe","1  -HY -03",0.31,null,null,null,null,null,null,null,null,null,null,null,null,null,null,null,null,{"$f":"SUM(T5:T27)","v":{"$error":"#REF!"}}]
["Wyłączniki różnicowo-prądowe","1  -HY -04",0.36,null,null,null,null,null,null,null,null,null,null,null,null,null,null,null,null,{"$f":"SUM(C2:S39)","v":7.6800000000000015}]
["Wyłącznik nadmiarowo/różnicowo-prądowy","1  -HY -05",0.31,null,null,null,null,null,null,null,null,null,null,null,null,null,null,null,null,{"$f":"IF(#REF!=\"\",0,1)","v":{"$error":"#REF!"}}]
["Pozostałe i akcesoria modułowe","1  -HY -06",0.31,null,null,null,null,null,null,null,null,null,null,null,null,null,null,null,null,{"$f":"IF(#REF!=\"\",0,1)","v":{"$error":"#REF!"}}]
["Wyłączniki silnikowe","1  -HY -07",0.3,null,null,null,null,null,null,null,null,null,null,null,null,null,null,null,null,{"$f":"IF(#REF!=\"\",0,1)","v":{"$error":"#REF!"}}]
["Akcesoria do wyłączników silnikowych","1  -HY -08",0.38,null,null,null,null,null,null,null,null,null,null,null,null,null,null,null,null,{"$f":"IF(#REF!=\"\",0,1)","v":{"$error":"#REF!"}}]
["Styczniki","1  -HY -09",0.28999999999999998,null,null,null,null,null,null,null,null,null,null,null,null,null,null,null,null,{"$f":"IF(#REF!=\"\",0,1)","v":{"$error":"#REF!"}}]
["Cewki do styczników","1  -HY -10",0.3,null,null,null,null,null,null,null,null,null,null,null,null,null,null,null,null,{"$f":"IF(C1=\"\",0,1)","v":1}]
["Akcesoria do styczników","1  -HY -11",0.3,null,null,null,null,null,null,null,null,null,null,null,null,null,null,null,null,{"$f":"IF(D1=\"\",0,1)","v":0}]
["Przekaźniki termiczne","1  -HY -12",0.36,null,null,null,null,null,null,null,null,null,null,null,null,null,null,null,null,{"$f":"IF(E1=\"\",0,1)","v":0}]
["Przekaźniki 20A 4P","1  -HY -13",0.3,null,null,null,null,null,null,null,null,null,null,null,null,null,null,null,null,{"$f":"IF(F1=\"\",0,1)","v":0}]
["Przemienniki czestotliwości","1  -HY -14",0.16,null,null,null,null,null,null,null,null,null,null,null,null,null,null,null,null,{"$f":"IF(G1=\"\",0,1)","v":0}]
["Przemienniki czestotliwości akcesoria","1  -HY -15",0.19,null,null,null,null,null,null,null,null,null,null,null,null,null,null,null,null,{"$f":"IF(H1=\"\",0,1)","v":0}]
["Bezpieczniki cylindryczne","1  -HY -16",0.3,null,null,null,null,null,null,null,null,null,null,null,null,null,null,null,null,{"$f":"IF(I1=\"\",0,1)","v":0}]
["Rozłączniki bezpiecznikowe","1  -HY -17",0.3]
["Wyłączniki kompactowe - UCB do 630A","1  -HY -18",0.36]
["Wyłączniki kompactowe - UPB do 1250A","1  -HY -19",0.36]
["Średnie napięcie","1  -HY -20",0.36]
["Wyłączniki kompactowe - akcesoria","1  -HY -21",0.36]
["Wyłączniki powietrzne + akcesoria","1  -HY -22",0.42]
["Średnie napięcie","1  -HY -30",0.23]
["Hyundai produkty promocyjne","9  -HH -45",0.45]
[]
[null,null,null,null,null,null,null,null,null,null,null,null,null,null,null,null,null,null,null,{"$f":"IF(J1=\"\",0,1)","v":0}]

{"sheet":"Cennik","index":2,"n_rows":2128,"n_cols":4,"rows_kept":2128,"cut":false,"hidden":false,"merged":[]}
["Nrumer katalogowy","Nazwa","Cennik netto","Grupa rabatu"]
["ACLH0015","HYUNDAI - DŁAWIK SILNIKOWY - WYJŚCIOWY OD FALOWNIKA  004 DO 015HF",403.1,"1  -HY -15"]
["ACLH0022","HYUNDAI - DŁAWIK SILNIKOWY - WYJŚCIOWY DO FALOWNIKA  022HF",431.4,"1  -HY -15"]
["ACLH0037","HYUNDAI - DŁAWIK SILNIKOWY - WYJŚCIOWY DO FALOWNIKA  037HF",488,"1  -HY -15"]
["ACLH0055","HYUNDAI - DŁAWIK SILNIKOWY - WYJŚCIOWY DO FALOWNIKA  055HF",622.29999999999995,"1  -HY -15"]
["ACLH0075","HYUNDAI - DŁAWIK SILNIKOWY - WYJŚCIOWY DO FALOWNIKA  075HF",650.6,"1  -HY -15"]
["ACLH011","HYUNDAI - DŁAWIK SILNIKOWY - WYJŚCIOWY DO FALOWNIKA  110HF",975.9,"1  -HY -15"]
["ACLH015","HYUNDAI - DŁAWIK SILNIKOWY - WYJŚCIOWY DO FALOWNIKA  150HF",1131.5,"1  -HY -15"]
["ACLH0185","HYUNDAI - DŁAWIK SILNIKOWY - WYJŚCIOWY DO FALOWNIKA  185HF",1301.2,"1  -HY -15"]
["ACLH022","HYUNDAI - DŁAWIK SILNIKOWY - WYJŚCIOWY DO FALOWNIKA  220HF",1379,"1  -HY -15"]
["ACLH030","HYUNDAI - DŁAWIK SILNIKOWY - WYJŚCIOWY DO FALOWNIKA  300HF",1626.6,"1  -HY -15"]
["ACLH037","HYUNDAI - DŁAWIK SILNIKOWY - WYJŚCIOWY DO FALOWNIKA  370HF",2312.5,"1  -HY -15"]
["ACLH045","HYUNDAI - DŁAWIK SILNIKOWY - WYJŚCIOWY DO FALOWNIKA  450HF",2885.4,"1  -HY -15"]
["ACLH055","HYUNDAI - DŁAWIK SILNIKOWY - WYJŚCIOWY DO FALOWNIKA  550HF",2998.5,"1  -HY -15"]
["ACLH075","HYUNDAI - DŁAWIK SILNIKOWY - WYJŚCIOWY DO FALOWNIKA  750HF",3366.3,"1  -HY -15"]
["ACLH090","HYUNDAI - DŁAWIK SILNIKOWY - WYJŚCIOWY DO FALOWNIKA  900HF",3670.4,"1  -HY -15"]
["ACLH110","HYUNDAI - DŁAWIK SILNIKOWY - WYJŚCIOWY DO FALOWNIKA  1100HF",4229.1000000000004,"1  -HY -15"]
["ACLH132","HYUNDAI - DŁAWIK SILNIKOWY - WYJŚCIOWY DO FALOWNIKA  1320HF",4872.6000000000004,"1  -HY -15"]
["ACLH160","HYUNDAI - DŁAWIK SILNIKOWY - WYJŚCIOWY DO FALOWNIKA  1600HF",5424.2,"1  -HY -15"]
["ACLH220","HYUNDAI - DŁAWIK SILNIKOWY - WYJŚCIOWY DO FALOWNIKA  2200HF",5848.5,"1  -HY -15"]
["ACLH280","HYUNDAI - DŁAWIK SILNIKOWY - WYJŚCIOWY DO FALOWNIKA  2800HF",6676,"1  -HY -15"]
["ACLH375","HYUNDAI - DŁAWIK SILNIKOWY - WYJŚCIOWY DO FALOWNIKA  3500HF",9186.5,"1  -HY -15"]
["ACLHI0015","HYUNDAI - DŁAWIK SIECIOWY - WEJŚCIOWY OD FALOWNIKA 004 DO 007HF",360.7,"1  -HY -15"]
["ACLHI0025","HYUNDAI - DŁAWIK SIECIOWY - WEJŚCIOWY DO FALOWNIKA 015HF",360.7,"1  -HY -15"]
["ACLHI0035","HYUNDAI - DŁAWIK SIECIOWY - WEJŚCIOWY DO FALOWNIKA 022HF",367.7,"1  -HY -15"]
["ACLHI0055","HYUNDAI - DŁAWIK SIECIOWY - WEJŚCIOWY DO FALOWNIKA 037HF",367.7,"1  -HY -15"]
["ACLHI0075","HYUNDAI - DŁAWIK SIECIOWY - WEJŚCIOWY DO FALOWNIKA 055HF",410.2,"1  -HY -15"]
["ACLHI011","HYUNDAI - DŁAWIK SIECIOWY - WEJŚCIOWY DO FALOWNIKA 075HF",565.79999999999995,"1  -HY -15"]
["ACLHI015","HYUNDAI - DŁAWIK SIECIOWY - WEJŚCIOWY DO FALOWNIKA 110HF",650.6,"1  -HY -15"]
["ACLHI022","HYUNDAI - DŁAWIK SIECIOWY - WEJŚCIOWY DO FALOWNIKA 150HF",693.1,"1  -HY -15"]
{"$rows_left_out":2098}